{"text_format":"1","workbook":"xlsx","n_sheets":18,"sheets":["Politique EP Ets","EP 1","EP 2","EP 3","EP 4","EP 5","EP 6","EP 7","EP 8","EP 9","EP 10","EP AGENT SANS POSTE 1","EP AGENT SANS POSTE 2","EP AGENT SANS POSTE 3","AIDE CALCUL DEPLACEMENT","LISTE DES DIPLOMES EP + DUREE","LISTE DES GRADES ET CATEGORIES","Liste Ets"],"not_rendered":{"charts":0,"images":4,"macros":1,"external_links":4,"defined_names":37,"comments":0,"pivot_tables":0},"unopened":[],"bounds":{"document_bytes":16777216,"sheet_cells":100000,"rows_first":2000,"rows_last":500,"rows_between":2000,"halvings":0,"cell_chars":16384,"cell_head_chars":4096},"cells_cut":0,"cells_raw":0,"read":"whole","date_system":"1900"}

{"sheet":"Politique EP Ets","index":0,"n_rows":26,"n_cols":6,"rows_kept":26,"cut":false,"hidden":false,"merged":[[13,0,13,6],[25,3,25,6],[20,1,20,3],[1,0,1,6],[3,1,3,5],[4,1,4,5],[9,0,9,6],[10,0,10,6]]}
[]
["Politique promotionnelle de l'établissement"]
[]
["Etablissement demandeur :","Choisir dans la liste"]
["Personne en charge du dossier :"]
["Nombre de demandes de financement présentées :"]
["Date CSE :"]
["Avis CSE :"]
[]
["La politique de mutualisation régionale Occitanie vise à augmenter les départs d'agent en promotion afin de répondre au besoin en personnel formé."]
{"$rows_left_out":17}
{"sheet":"EP 1","index":1,"n_rows":25,"n_cols":10,"rows_kept":25,"cut":false,"hidden":false,"merged":[[1,2,1,5],[10,2,10,3],[6,8,6,9],[7,8,7,9],[7,1,7,3],[3,2,3,6],[3,0,3,1],[5,0,5,9],[8,1,8,3],[8,8,8,9],[9,8,9,9],[10,8,10,9],[11,4,11,5],[14,5,15,5],[12,1,12,5],[9,0,9,2],[11,8,11,9],[11,1,11,2],[12,8,12,9],[24,1,24,3],[24,6,24,7],[14,1,14,2],[14,8,15,8],[13,0,13,9],[14,6,15,6],[14,3,15,3],[14,0,15,0],[14,4,15,4],[14,7,15,7],[24,4,24,5],[24,8,24,9],[14,9,15,9]]}
[]
[null,null," DOSSIER  EP ",null,null,null,"Date limite de dépôt :\n17/11/2023"]
[]
["Etablissement demandeur :",null,"Choisir dans la liste"]
[]
["Descriptif de la demande"]
["Priorité du dossier : N°",null,null,null,null,null,null,null,"Précisions Particulières :  "]
["NOM- Prénom : ",null,null,null,"Grade  :","Choisir dans la liste","N°INSEE agent :",null,"ASH ayant bénéficié de la formation 70h "]
["Intitulé de la formation / Diplôme visé :","Choisir dans la liste",null,null,"Forfait de référence :",{"$f":"IF(F8=\"Choisir dans la liste\",\"\",IF(D10>0,\"21,61\",VLOOKUP(F8,'LISTE DES GRADES ET CATEGORIES'!A5:B20,2,FALSE)))","v":""},null,null,"Formation complète"]
["Si formation inférieure à 52 jours, préciser nombre d'heures :",null,null,null,null,null,null,null,"Au-delà des 720 jours CFP"]
{"$rows_left_out":16}
{"sheet":"EP 2","index":2,"n_rows":25,"n_cols":10,"rows_kept":25,"cut":false,"hidden":false,"merged":[[7,1,7,3],[7,8,7,9],[1,2,1,5],[3,0,3,1],[3,2,3,6],[5,0,5,9],[6,8,6,9],[13,0,13,9],[8,1,8,3],[8,8,8,9],[9,0,9,2],[9,8,9,9],[10,2,10,3],[10,8,10,9],[11,1,11,2],[11,4,11,5],[11,8,11,9],[12,1,12,5],[12,8,12,9],[14,0,15,0],[14,1,14,2],[14,3,15,3],[14,4,15,4],[14,5,15,5],[14,7,15,7],[14,8,15,8],[14,9,15,9],[24,1,24,3],[24,4,24,5],[24,6,24,7],[24,8,24,9],[14,6,15,6]]}
[]
[null,null," DOSSIER  EP ",null,null,null,"Date limite de dépôt :\n17/11/2023"]
[]
["Etablissement demandeur :",null,"Choisir dans la liste"]
[]
["Descriptif de la demande"]
["Priorité du dossier : N°",null,null,null,null,null,null,null,"Précisions Particulières :  "]
["NOM- Prénom : ",null,null,null,"Grade  :","Choisir dans la liste","N°INSEE agent :",null,"ASH ayant bénéficié de la formation 70h "]
["Intitulé de la formation / Diplôme visé :","Choisir dans la liste",null,null,"Forfait de référence :",{"$f":"IF(F8=\"Choisir dans la liste\",\"\",IF(D10>0,\"21,61\",VLOOKUP(F8,'LISTE DES GRADES ET CATEGORIES'!A5:B20,2,FALSE)))","v":""},null,null,"Formation complète"]
["Si formation inférieure à 52 jours, préciser nombre d'heures :",null,null,null,null,null,null,null,"Au-delà des 720 jours CFP"]
{"$rows_left_out":16}
{"sheet":"EP 3","index":3,"n_rows":25,"n_cols":10,"rows_kept":25,"cut":false,"hidden":false,"merged":[[7,1,7,3],[7,8,7,9],[1,2,1,5],[3,0,3,1],[3,2,3,6],[5,0,5,9],[6,8,6,9],[13,0,13,9],[8,1,8,3],[8,8,8,9],[9,0,9,2],[9,8,9,9],[10,2,10,3],[10,8,10,9],[11,1,11,2],[11,4,11,5],[11,8,11,9],[12,1,12,5],[12,8,12,9],[14,0,15,0],[14,1,14,2],[14,3,15,3],[14,4,15,4],[14,5,15,5],[14,7,15,7],[14,8,15,8],[14,9,15,9],[24,1,24,3],[24,4,24,5],[24,6,24,7],[24,8,24,9],[14,6,15,6]]}
[]
[null,null," DOSSIER  EP ",null,null,null,"Date limite de dépôt :\n17/11/2023"]
[]
["Etablissement demandeur :",null,"Choisir dans la liste"]
[]
["Descriptif de la demande"]
["Priorité du dossier : N°",null,null,null,null,null,null,null,"Précisions Particulières :  "]
["NOM- Prénom : ",null,null,null,"Grade  :","Choisir dans la liste","N°INSEE agent :",null,"ASH ayant bénéficié de la formation 70h "]
["Intitulé de la formation / Diplôme visé :","Choisir dans la liste",null,null,"Forfait de référence :",{"$f":"IF(F8=\"Choisir dans la liste\",\"\",IF(D10>0,\"21,61\",VLOOKUP(F8,'LISTE DES GRADES ET CATEGORIES'!A5:B20,2,FALSE)))","v":""},null,null,"Formation complète"]
["Si formation inférieure à 52 jours, préciser nombre d'heures :",null,null,null,null,null,null,null,"Au-delà des 720 jours CFP"]
{"$rows_left_out":16}
{"sheet":"EP 4","index":4,"n_rows":25,"n_cols":10,"rows_kept":25,"cut":false,"hidden":false,"merged":[[7,1,7,3],[7,8,7,9],[1,2,1,5],[3,0,3,1],[3,2,3,6],[5,0,5,9],[6,8,6,9],[13,0,13,9],[8,1,8,3],[8,8,8,9],[9,0,9,2],[9,8,9,9],[10,2,10,3],[10,8,10,9],[11,1,11,2],[11,4,11,5],[11,8,11,9],[12,1,12,5],[12,8,12,9],[14,0,15,0],[14,1,14,2],[14,3,15,3],[14,4,15,4],[14,5,15,5],[14,7,15,7],[14,8,15,8],[14,9,15,9],[24,1,24,3],[24,4,24,5],[24,6,24,7],[24,8,24,9],[14,6,15,6]]}
[]
[null,null," DOSSIER  EP ",null,null,null,"Date limite de dépôt :\n17/11/2023"]
[]
["Etablissement demandeur :",null,"Choisir dans la liste"]
[]
["Descriptif de la demande"]
["Priorité du dossier : N°",null,null,null,null,null,null,null,"Précisions Particulières :  "]
["NOM- Prénom : ",null,null,null,"Grade  :","Choisir dans la liste","N°INSEE agent :",null,"ASH ayant bénéficié de la formation 70h "]
["Intitulé de la formation / Diplôme visé :","Choisir dans la liste",null,null,"Forfait de référence :",{"$f":"IF(F8=\"Choisir dans la liste\",\"\",IF(D10>0,\"21,61\",VLOOKUP(F8,'LISTE DES GRADES ET CATEGORIES'!A5:B20,2,FALSE)))","v":""},null,null,"Formation complète"]
["Si formation inférieure à 52 jours, préciser nombre d'heures :",null,null,null,null,null,null,null,"Au-delà des 720 jours CFP"]
{"$rows_left_out":16}
{"sheet":"EP 5","index":5,"n_rows":25,"n_cols":10,"rows_kept":25,"cut":false,"hidden":false,"merged":[[7,1,7,3],[7,8,7,9],[1,2,1,5],[3,0,3,1],[3,2,3,6],[5,0,5,9],[6,8,6,9],[13,0,13,9],[8,1,8,3],[8,8,8,9],[9,0,9,2],[9,8,9,9],[10,2,10,3],[10,8,10,9],[11,1,11,2],[11,4,11,5],[11,8,11,9],[12,1,12,5],[12,8,12,9],[14,0,15,0],[14,1,14,2],[14,3,15,3],[14,4,15,4],[14,5,15,5],[14,7,15,7],[14,8,15,8],[14,9,15,9],[24,1,24,3],[24,4,24,5],[24,6,24,7],[24,8,24,9],[14,6,15,6]]}
[]
[null,null," DOSSIER  EP ",null,null,null,"Date limite de dépôt :\n17//11/2023"]
[]
["Etablissement demandeur :",null,"Choisir dans la liste"]
[]
["Descriptif de la demande"]
["Priorité du dossier : N°",null,null,null,null,null,null,null,"Précisions Particulières :  "]
["NOM- Prénom : ",null,null,null,"Grade  :","Choisir dans la liste","N°INSEE agent :",null,"ASH ayant bénéficié de la formation 70h "]
["Intitulé de la formation / Diplôme visé :","Choisir dans la liste",null,null,"Forfait de référence :",{"$f":"IF(F8=\"Choisir dans la liste\",\"\",IF(D10>0,\"21,61\",VLOOKUP(F8,'LISTE DES GRADES ET CATEGORIES'!A5:B20,2,FALSE)))","v":""},null,null,"Formation complète"]
["Si formation inférieure à 52 jours, préciser nombre d'heures :",null,null,null,null,null,null,null,"Au-delà des 720 jours CFP"]
{"$rows_left_out":16}
{"sheet":"EP 6","index":6,"n_rows":25,"n_cols":10,"rows_kept":25,"cut":false,"hidden":false,"merged":[[7,1,7,3],[7,8,7,9],[1,2,1,5],[3,0,3,1],[3,2,3,6],[5,0,5,9],[6,8,6,9],[13,0,13,9],[8,1,8,3],[8,8,8,9],[9,0,9,2],[9,8,9,9],[10,2,10,3],[10,8,10,9],[11,1,11,2],[11,4,11,5],[11,8,11,9],[12,1,12,5],[12,8,12,9],[14,0,15,0],[14,1,14,2],[14,3,15,3],[14,4,15,4],[14,5,15,5],[14,7,15,7],[14,8,15,8],[14,9,15,9],[24,1,24,3],[24,4,24,5],[24,6,24,7],[24,8,24,9],[14,6,15,6]]}
[]
[null,null," DOSSIER  EP ",null,null,null,"Date limite de dépôt :\n17/11/2023"]
[]
["Etablissement demandeur :",null,"Choisir dans la liste"]
[]
["Descriptif de la demande"]
["Priorité du dossier : N°",null,null,null,null,null,null,null,"Précisions Particulières :  "]
["NOM- Prénom : ",null,null,null,"Grade  :","Choisir dans la liste","N°INSEE agent :",null,"ASH ayant bénéficié de la formation 70h "]
["Intitulé de la formation / Diplôme visé :","Choisir dans la liste",null,null,"Forfait de référence :",{"$f":"IF(F8=\"Choisir dans la liste\",\"\",IF(D10>0,\"21,61\",VLOOKUP(F8,'LISTE DES GRADES ET CATEGORIES'!A5:B20,2,FALSE)))","v":""},null,null,"Formation complète"]
["Si formation inférieure à 52 jours, préciser nombre d'heures :",null,null,null,null,null,null,null,"Au-delà des 720 jours CFP"]
{"$rows_left_out":16}
{"sheet":"EP 7","index":7,"n_rows":25,"n_cols":10,"rows_kept":25,"cut":false,"hidden":false,"merged":[[7,1,7,3],[7,8,7,9],[1,2,1,5],[3,0,3,1],[3,2,3,6],[5,0,5,9],[6,8,6,9],[13,0,13,9],[8,1,8,3],[8,8,8,9],[9,0,9,2],[9,8,9,9],[10,2,10,3],[10,8,10,9],[11,1,11,2],[11,4,11,5],[11,8,11,9],[12,1,12,5],[12,8,12,9],[14,0,15,0],[14,1,14,2],[14,3,15,3],[14,4,15,4],[14,5,15,5],[14,7,15,7],[14,8,15,8],[14,9,15,9],[24,1,24,3],[24,4,24,5],[24,6,24,7],[24,8,24,9],[14,6,15,6]]}
[]
[null,null," DOSSIER  EP ",null,null,null,"Date limite de dépôt :\n17/11/2023"]
[]
["Etablissement demandeur :",null,"Choisir dans la liste"]
[]
["Descriptif de la demande"]
["Priorité du dossier : N°",null,null,null,null,null,null,null,"Précisions Particulières :  "]
["NOM- Prénom : ",null,null,null,"Grade  :","Choisir dans la liste","N°INSEE agent :",null,"ASH ayant bénéficié de la formation 70h "]
["Intitulé de la formation / Diplôme visé :","Choisir dans la liste",null,null,"Forfait de référence :",{"$f":"IF(F8=\"Choisir dans la liste\",\"\",IF(D10>0,\"21,61\",VLOOKUP(F8,'LISTE DES GRADES ET CATEGORIES'!A5:B20,2,FALSE)))","v":""},null,null,"Formation complète"]
["Si formation inférieure à 52 jours, préciser nombre d'heures :",null,null,null,null,null,null,null,"Au-delà des 720 jours CFP"]
{"$rows_left_out":16}
{"sheet":"EP 8","index":8,"n_rows":25,"n_cols":10,"rows_kept":25,"cut":false,"hidden":false,"merged":[[7,1,7,3],[7,8,7,9],[1,2,1,5],[3,0,3,1],[3,2,3,6],[5,0,5,9],[6,8,6,9],[13,0,13,9],[8,1,8,3],[8,8,8,9],[9,0,9,2],[9,8,9,9],[10,2,10,3],[10,8,10,9],[11,1,11,2],[11,4,11,5],[11,8,11,9],[12,1,12,5],[12,8,12,9],[14,0,15,0],[14,1,14,2],[14,3,15,3],[14,4,15,4],[14,5,15,5],[14,7,15,7],[14,8,15,8],[14,9,15,9],[24,1,24,3],[24,4,24,5],[24,6,24,7],[24,8,24,9],[14,6,15,6]]}
[]
[null,null," DOSSIER  EP ",null,null,null,"Date limite de dépôt :\n17/11/2023"]
[]
["Etablissement demandeur :",null,"Choisir dans la liste"]
[]
["Descriptif de la demande"]
["Priorité du dossier : N°",null,null,null,null,null,null,null,"Précisions Particulières :  "]
["NOM- Prénom : ",null,null,null,"Grade  :","Choisir dans la liste","N°INSEE agent :",null,"ASH ayant bénéficié de la formation 70h "]
["Intitulé de la formation / Diplôme visé :","Choisir dans la liste",null,null,"Forfait de référence :",{"$f":"IF(F8=\"Choisir dans la liste\",\"\",IF(D10>0,\"21,61\",VLOOKUP(F8,'LISTE DES GRADES ET CATEGORIES'!A5:B20,2,FALSE)))","v":""},null,null,"Formation complète"]
["Si formation inférieure à 52 jours, préciser nombre d'heures :",null,null,null,null,null,null,null,"Au-delà des 720 jours CFP"]
{"$rows_left_out":16}
{"sheet":"EP 9","index":9,"n_rows":25,"n_cols":10,"rows_kept":25,"cut":false,"hidden":false,"merged":[[7,1,7,3],[7,8,7,9],[1,2,1,5],[3,0,3,1],[3,2,3,6],[5,0,5,9],[6,8,6,9],[13,0,13,9],[8,1,8,3],[8,8,8,9],[9,0,9,2],[9,8,9,9],[10,2,10,3],[10,8,10,9],[11,1,11,2],[11,4,11,5],[11,8,11,9],[12,1,12,5],[12,8,12,9],[14,0,15,0],[14,1,14,2],[14,3,15,3],[14,4,15,4],[14,5,15,5],[14,7,15,7],[14,8,15,8],[14,9,15,9],[24,1,24,3],[24,4,24,5],[24,6,24,7],[24,8,24,9],[14,6,15,6]]}
[]
[null,null," DOSSIER  EP ",null,null,null,"Date limite de dépôt :\n17/11/2023"]
[]
["Etablissement demandeur :",null,"Choisir dans la liste"]
[]
["Descriptif de la demande"]
["Priorité du dossier : N°",null,null,null,null,null,null,null,"Précisions Particulières :  "]
["NOM- Prénom : ",null,null,null,"Grade  :","Choisir dans la liste","N°INSEE agent :",null,"ASH ayant bénéficié de la formation 70h "]
["Intitulé de la formation / Diplôme visé :","Choisir dans la liste",null,null,"Forfait de référence :",{"$f":"IF(F8=\"Choisir dans la liste\",\"\",IF(D10>0,\"21,61\",VLOOKUP(F8,'LISTE DES GRADES ET CATEGORIES'!A5:B20,2,FALSE)))","v":""},null,null,"Formation complète"]
["Si formation inférieure à 52 jours, préciser nombre d'heures :",null,null,null,null,null,null,null,"Au-delà des 720 jours CFP"]
{"$rows_left_out":16}
{"sheet":"EP 10","index":10,"n_rows":25,"n_cols":10,"rows_kept":25,"cut":false,"hidden":false,"merged":[[7,1,7,3],[7,8,7,9],[1,2,1,5],[3,0,3,1],[3,2,3,6],[5,0,5,9],[6,8,6,9],[13,0,13,9],[8,1,8,3],[8,8,8,9],[9,0,9,2],[9,8,9,9],[10,2,10,3],[10,8,10,9],[11,1,11,2],[11,4,11,5],[11,8,11,9],[12,1,12,5],[12,8,12,9],[14,0,15,0],[14,1,14,2],[14,3,15,3],[14,4,15,4],[14,5,15,5],[14,7,15,7],[14,8,15,8],[14,9,15,9],[24,1,24,3],[24,4,24,5],[24,6,24,7],[24,8,24,9],[14,6,15,6]]}
[]
[null,null," DOSSIER  EP ",null,null,null,"Date limite de dépôt :\n17/11/2023"]
[]
["Etablissement demandeur :",null,"Choisir dans la liste"]
[]
["Descriptif de la demande"]
["Priorité du dossier : N°",null,null,null,null,null,null,null,"Précisions Particulières :  "]
["NOM- Prénom : ",null,null,null,"Grade  :","Choisir dans la liste","N°INSEE agent :",null,"ASH ayant bénéficié de la formation 70h "]
["Intitulé de la formation / Diplôme visé :","Choisir dans la liste",null,null,"Forfait de référence :",{"$f":"IF(F8=\"Choisir dans la liste\",\"\",IF(D10>0,\"21,61\",VLOOKUP(F8,'LISTE DES GRADES ET CATEGORIES'!A5:B20,2,FALSE)))","v":""},null,null,"Formation complète"]
["Si formation inférieure à 52 jours, préciser nombre d'heures :",null,null,null,null,null,null,null,"Au-delà des 720 jours CFP"]
{"$rows_left_out":16}
{"sheet":"EP AGENT SANS POSTE 1","index":11,"n_rows":25,"n_cols":10,"rows_kept":25,"cut":false,"hidden":false,"merged":[[7,1,7,3],[7,8,7,9],[1,2,1,5],[3,0,3,1],[3,2,3,6],[5,0,5,9],[6,8,6,9],[8,1,8,3],[8,8,8,9],[9,0,9,2],[9,8,9,9],[10,2,10,3],[10,8,10,9],[24,6,24,7],[24,8,24,9],[11,8,11,9],[12,1,12,5],[13,0,13,9],[14,6,15,6],[14,7,15,7],[14,8,15,8],[14,9,15,9],[14,0,15,0],[14,1,14,2],[14,3,15,3],[14,4,15,4],[14,5,15,5],[11,1,11,2],[11,4,11,5]]}
[]
[null,null," EP AGENT SANS POSTE A L'ISSUE DE LEUR CURSUS",null,null,null,"Date limite de dépôt :\n17/11/2023"]
[]
["Etablissement demandeur :",null,"Choisir dans la liste"]
[]
["Descriptif de la demande"]
["Priorité du dossier : N°",null,null,null,null,null,null,null,"Précisions Particulières :  "]
["NOM- Prénom : ",null,null,null,"Grade  :","Choisir dans la liste","N°INSEE agent :",null,"ASH ayant bénéficié de la formation 70h"]
["Intitulé de la formation / Diplôme visé :","Choisir dans la liste",null,null,"Forfait de référence :",{"$f":"IF(F8=\"Choisir dans la liste\",\"\",IF(D10>0,\"21,61\",VLOOKUP(F8,'LISTE DES GRADES ET CATEGORIES'!A5:B20,2,FALSE)))","v":""},null,null,"Formation complète"]
["Si formation inférieure à 52 jours, préciser nombre d'heures :",null,null,null,null,null,null,null,"Module à repasser / Redoublement"]
{"$rows_left_out":16}
{"sheet":"EP AGENT SANS POSTE 2","index":12,"n_rows":25,"n_cols":10,"rows_kept":25,"cut":false,"hidden":false,"merged":[[7,1,7,3],[7,8,7,9],[1,2,1,5],[3,0,3,1],[3,2,3,6],[5,0,5,9],[6,8,6,9],[8,1,8,3],[8,8,8,9],[9,0,9,2],[9,8,9,9],[10,2,10,3],[10,8,10,9],[14,0,15,0],[14,1,14,2],[14,3,15,3],[14,4,15,4],[14,5,15,5],[11,1,11,2],[11,4,11,5],[11,8,11,9],[12,1,12,5],[13,0,13,9],[14,6,15,6],[14,7,15,7],[14,8,15,8],[14,9,15,9],[24,6,24,7],[24,8,24,9]]}
[]
[null,null," EP AGENT SANS POSTE A L'ISSUE DE LEUR CURSUS",null,null,null,"Date limite de dépôt :\n17/11/2023"]
[]
["Etablissement demandeur :",null,"Choisir dans la liste"]
[]
["Descriptif de la demande"]
["Priorité du dossier : N°",null,null,null,null,null,null,null,"Précisions Particulières :  "]
["NOM- Prénom : ",null,null,null,"Grade  :","Choisir dans la liste","N°INSEE agent :",null,"ASH ayant bénéficié de la formation 70h"]
["Intitulé de la formation / Diplôme visé :","Choisir dans la liste",null,null,"Forfait de référence :",{"$f":"IF(F8=\"Choisir dans la liste\",\"\",IF(D10>0,\"21,61\",VLOOKUP(F8,'LISTE DES GRADES ET CATEGORIES'!A5:B20,2,FALSE)))","v":""},null,null,"Formation complète"]
["Si formation inférieure à 52 jours, préciser nombre d'heures :",null,null,null,null,null,null,null,"Module à repasser / Redoublement"]
{"$rows_left_out":16}
{"sheet":"EP AGENT SANS POSTE 3","index":13,"n_rows":25,"n_cols":10,"rows_kept":25,"cut":false,"hidden":false,"merged":[[7,1,7,3],[7,8,7,9],[1,2,1,5],[3,0,3,1],[3,2,3,6],[5,0,5,9],[6,8,6,9],[8,1,8,3],[8,8,8,9],[9,0,9,2],[9,8,9,9],[10,2,10,3],[10,8,10,9],[14,0,15,0],[14,1,14,2],[14,3,15,3],[14,4,15,4],[14,5,15,5],[11,1,11,2],[11,4,11,5],[11,8,11,9],[12,1,12,5],[13,0,13,9],[14,6,15,6],[14,7,15,7],[14,8,15,8],[14,9,15,9],[24,6,24,7],[24,8,24,9]]}
[]
[null,null," EP AGENT SANS POSTE A L'ISSUE DE LEUR CURSUS",null,null,null,"Date limite de dépôt :\n17/11/2023"]
[]
["Etablissement demandeur :",null,"Choisir dans la liste"]
[]
["Descriptif de la demande"]
["Priorité du dossier : N°",null,null,null,null,null,null,null,"Précisions Particulières :  "]
["NOM- Prénom : ",null,null,null,"Grade  :","Choisir dans la liste","N°INSEE agent :",null,"ASH ayant bénéficié de la formation 70h"]
["Intitulé de la formation / Diplôme visé :","Choisir dans la liste",null,null,"Forfait de référence :",{"$f":"IF(F8=\"Choisir dans la liste\",\"\",IF(D10>0,\"21,61\",VLOOKUP(F8,'LISTE DES GRADES ET CATEGORIES'!A5:B20,2,FALSE)))","v":""},null,null,"Formation complète"]
["Si formation inférieure à 52 jours, préciser nombre d'heures :",null,null,null,null,null,null,null,"Module à repasser / Redoublement"]
{"$rows_left_out":16}
{"sheet":"AIDE CALCUL DEPLACEMENT","index":14,"n_rows":53,"n_cols":16,"rows_kept":53,"cut":false,"hidden":false,"merged":[[52,11,53,13],[52,6,53,10],[3,5,3,6],[4,5,4,6],[6,0,6,15],[39,8,40,9],[48,8,49,9],[23,11,23,12],[39,11,40,12],[48,11,49,12],[7,0,7,3],[13,0,13,3],[17,1,17,3],[22,1,22,3],[14,0,14,3],[20,1,20,3],[18,1,18,3],[27,13,27,15],[7,13,7,15],[12,8,12,9],[13,8,13,9],[0,0,0,15],[3,8,3,9],[4,8,4,9],[3,10,3,13],[2,1,2,4],[4,1,4,3]]}
["Fiche d'aide au calcul des déplacements (Transport/hébergement/repas)"]
[]
["Nom-Prénom-Grade"]
[null,null,null,null,null,"Date début",null,"Date Fin","Nbre jours en formation"]
["Intitulé de la formation :","Choisir dans la liste",null,null,null,null,null,null,{"$f":"IF(B5=\"Choisir dans la liste\",\"\",VLOOKUP(B5,'LISTE DES DIPLOMES EP + DUREE'!B3:F34,5,FALSE))","v":""}]
[]
["Détail frais de transport"]
["Utilisation véhicule",null,null,null,null,null,null,null,null,null,null,null,null,"Récapitulatif cumul km parcourus"]
["Catégorie          (puissance fiscale)","Jusqu'à 2 000 Km","Nbre de km","Montant","de 2 001 Km à 10 000 Km","Nbre de Km","Montant ","Au - delà de 10 000 Km","Nbre de Km","Montant","TOTAL",null,null,"Mois","km","cumul"]
["5 CV et moins",0.32,null,{"$f":"B10*C10","v":0},0.4,null,{"$f":"E10*F10","v":0},0.23,null,{"$f":"H10*I10","v":0},{"$f":"D10+G10+J10","v":0},null,null,"Janvier",null,{"$f":"O10","v":0}]
{"$rows_left_out":44}
{"sheet":"LISTE DES DIPLOMES EP + DUREE","index":15,"n_rows":34,"n_cols":13,"rows_kept":34,"cut":false,"hidden":false,"merged":[]}
["Code diplôme","Diplôme","Durée réglementaire de la formation en semaines","durée réglementaire de la formation en heures","Durée en mois","DUREE DE PRISE EN CHARGE (EN JOURS POUR FD)","DUREE DE PRISE EN CHARGE (EN MOIS POUR SALAIRES) ARRONDI SUP","nombre mois 1ere année","nombre mois 2ème année","nombre mois 3ème année","nombre mois 4ème année","nombre mois 5ème année","Colonne1"]
[null,"Choisir dans la liste",null,null,null,0,0,null,null,null,null,null,{"$f":"SUM('LISTE DES DIPLOMES EP + DUREE'!$H2:$L2)","v":0}]
["2bis","DE aide-soignant 1 540 h","44 semaines (1540h) décret 10 juin 2021 22semaine théorie+ 22 semaines stage",1540,{"$f":"'LISTE DES DIPLOMES EP + DUREE'!$D3/151.67","v":10.153622997296763},220,10.5,10.5,null,null,null,0]
[2,"DE aide-soignant 1 365 h (agent ASHQ)","39 semaines (1365h) décret 10 juin 2021",1365,{"$f":"'LISTE DES DIPLOMES EP + DUREE'!$D4/151.67","v":8.9998022021494037},175,9,9,null,null,null,0]
[3,"DE cadre de santé","41 semaines (1435h) ",1435,{"$f":"'LISTE DES DIPLOMES EP + DUREE'!$D5/151.67","v":9.4613305202083477},205,9.5,3.5,6,null,null,0]
[6,"DE Formation de l'infirmier en pratique avancée (IPA)","1549h 4 semestres universitaires",1549,{"$f":"'LISTE DES DIPLOMES EP + DUREE'!$D6/151.67","v":10.21296235247577},514,10.5,1.5,5.5,3.5]
[1,"DE IDE","120 semaines (4200h) 2100h théorie + 2100h de stage",4200,{"$f":"'LISTE DES DIPLOMES EP + DUREE'!$D7/151.67","v":27.691699083536626},600,28,3.5,9.5,9.5,5.5,0]
[5,"DE infirmier anesthésiste","24 mois (2940h) 2030h théorie +910h de stage",2940,{"$f":"'LISTE DES DIPLOMES EP + DUREE'!$D8/151.67","v":19.384189358475638},487,19.5,2.5,9,8,null,0]
[4,"DE infirmier de bloc opératoire","24 mois (2800h) 1155h théorie + 1645h de stage 09/2022",2800,{"$f":"'LISTE DES DIPLOMES EP + DUREE'!$D9/151.67","v":18.461132722357753},487,18.5,3.5,9.5,5.5,null,0]
[7,"DEAES accompagnant éducatif et social","39 semaines (1365h) 560h de théorie +805h de stage",1365,{"$f":"'LISTE DES DIPLOMES EP + DUREE'!$D10/151.67","v":8.9998022021494037},195,9,2.5,6.5]
{"$rows_left_out":25}
{"sheet":"LISTE DES GRADES ET CATEGORIES","index":16,"n_rows":20,"n_cols":2,"rows_kept":20,"cut":false,"hidden":true,"merged":[]}
["Forfaits mensuel par grade ou catégorie"]
[]
["Grade","forfait"]
["Choisir dans la liste"]
["ADJ ADM",3050]
["AEQ",3050]
["ASHQ",3050]
["AS",3450]
["AMP",3450]
["ACCOMPAGNANT EDUC ET SOCIAL",3450]
{"$rows_left_out":11}
{"sheet":"Liste Ets","index":17,"n_rows":107,"n_cols":1,"rows_kept":107,"cut":false,"hidden":true,"merged":[]}
["Choisir dans la liste"]
["MID001 CH AX-LES-THERMES"]
["MID003 CHI DES VALLEES DE L'ARIEGE"]
["MID007 EHPAD MIREPOIX"]
["MID010 CH ARIEGE COUSERANS ST GIRONS"]
["MID011 EHPAD ST-LIZIER"]
["MID012 EHPAD SAVERDUN"]
["MID013 CH TARASCON S/ARIEGE"]
["MID014 EHPAD AUBIN"]
["MID015 EHPAD CAPDENAC"]
{"$rows_left_out":97}